{"text_format":"1","workbook":"xlsx","n_sheets":16,"sheets":["Recommended Action Plan","Decision Model Rules","Test of Resilience","Summary Sheet","Insolvency Output","Interest Rate Output","Liquidity Output","Share Risks","Credit Risk-5","Credit Risk-4","Credit Risk-3","Credit Risk-2","Credit Risk-1","Interest Rate Input","Liquidity Input","Credit Input"],"not_rendered":{"charts":0,"images":0,"macros":1,"external_links":1,"defined_names":290,"comments":0,"pivot_tables":0},"unopened":[],"bounds":{"document_bytes":16777216,"sheet_cells":100000,"rows_first":2000,"rows_last":500,"rows_between":2000,"halvings":0,"cell_chars":16384,"cell_head_chars":4096},"cells_cut":0,"cells_raw":0,"read":"whole","date_system":"1900"}

{"sheet":"Recommended Action Plan","index":0,"n_rows":46,"n_cols":6,"rows_kept":46,"cut":false,"hidden":false,"merged":[[8,1,8,4],[9,1,9,4],[10,1,10,4],[11,1,11,4],[12,1,12,4],[41,2,42,2],[41,3,42,3],[45,3,45,6],[39,2,40,2],[39,3,40,3],[13,1,13,4],[14,1,14,4],[15,1,15,4],[16,1,16,4],[17,1,17,4]]}
["Name of the Institution :",{"$f":"IF('Credit Input'!C1=\"\",\"\",'Credit Input'!C1)","v":""}]
["Reporting Base Date:",{"$f":"'Credit Input'!C3","v":"00:00:00"}]
[]
[null,null,"Rating","Zone"]
["Result of WAR MATRIX (Test-I)",{"$f":"'Test of Resilience'!I18","v":20},{"$f":"IF(B5>80,1,IF(B5>70,2,IF(B5>60,3,IF(B5>40,4,5))))","v":5}]
["Result of WIR MATRIX (Test-II)",{"$f":"'Test of Resilience'!H26","v":0},{"$f":"IF(B6<15%,1,IF(B6<25%,2,IF(B6<45%,3,IF(B6<60%,4,5))))","v":1}]
["WAR-WIR MATRIX",null,null,"WAR-WIR"]
[]
["Risk Factors","Recommended Action Plan"]
["1. Interest Risk –Increase in Interest Rate ",{"$f":"'Test of Resilience'!J9","v":"Submission of: Three Year Capital Management Plan\nEnsure proper compliance of ALM Guidelines\nALCO meeting minutes."}]
{"$rows_left_out":37}
{"sheet":"Decision Model Rules","index":1,"n_rows":56,"n_cols":18,"rows_kept":56,"cut":false,"hidden":false,"merged":[[4,0,4,1],[5,0,5,1],[3,0,3,1],[8,0,9,1],[8,2,8,4],[55,4,55,7],[10,0,12,0],[44,11,44,13],[49,3,50,3],[49,4,50,4],[51,3,52,3],[51,4,52,4]]}
["Name of the Institution :",null,{"$f":"IF('Credit Input'!C1=\"\",\"\",'Credit Input'!C1)","v":""}]
["Reporting Base Date:",null,{"$f":"'Credit Input'!C3","v":"00:00:00"}]
[]
[null,null,null,"Rating","Zone"]
["Result of WAR MATRIX (Test-I)",null,{"$f":"'Test of Resilience'!I18","v":20},{"$f":"IF(C5>80,1,IF(C5>70,2,IF(C5>60,3,IF(C5>40,4,5))))","v":5}]
["Result of WIR MATRIX (Test-II)",null,{"$f":"'Test of Resilience'!H26","v":0},{"$f":"IF(C6<15%,1,IF(C6<25%,2,IF(C6<45%,3,IF(C6<60%,4,5))))","v":1},null,null,null,null,null,null,null,null,0.1,0.11]
[]
["WAR-WIR MATRIX",null,null,null,null,null,null,null,null,null,null,null,1,0.8,0.6]
["WAR-WIR Matrix",null,"WAR"]
[null,null,"Green","Yellow","Red",null,null,null,null,null,null,null,{"$f":"#REF!*100*$M$8","v":{"$error":"#REF!"}},{"$f":"#REF!*100*$N$8","v":{"$error":"#REF!"}},{"$f":"M10*$O$8","v":{"$error":"#REF!"}}]
{"$rows_left_out":47}
{"sheet":"Test of Resilience","index":2,"n_rows":64,"n_cols":17,"rows_kept":64,"cut":false,"hidden":false,"merged":[[42,10,42,12],[57,2,58,2],[57,3,58,3],[59,2,60,2],[59,3,60,3],[63,3,63,6],[30,3,32,3],[5,8,6,8],[5,9,6,9],[7,2,7,3],[7,4,7,5],[7,6,7,7],[17,2,17,3],[17,4,17,5],[17,6,17,7],[28,3,29,4],[25,1,25,2],[22,1,24,2],[21,1,21,7],[28,1,32,2],[28,5,28,7],[4,0,4,7],[5,0,6,0],[5,1,6,1],[5,2,5,3],[5,4,5,5],[5,6,5,7]]}
["Name of the Institution :",{"$f":"IF('Credit Input'!C1=\"\",\"\",'Credit Input'!C1)","v":""}]
["Reporting Base Date:",{"$f":"'Credit Input'!C3","v":"00:00:00"}]
[]
["Test-I : WAR MATRIX"]
["Risk Shocks in Stress Testing"]
["Risk Factors",null,"Minor",null,"Moderate",null,"Major",null,"HWAR","RAP",null,0.1,0.12]
[null,null,"Zone","Score","Zone","Score","Zone","Score",null,null,null,1,0.8,0.6]
[null,"Weight",{"$f":"F38","v":0.5},null,{"$f":"F39","v":0.3},null,{"$f":"F40","v":0.2},null,{"$f":"SUM(C8,E8,G8)","v":1}]
["1. Interest Risk –Increase in Interest Rate ",0.1,{"$f":"'Summary Sheet'!B14","v":0},{"$f":"IF(C9<$L$6,0,IF(C9<$M$6,100*B9*$C$39,100*B9))","v":0},{"$f":"'Summary Sheet'!C14","v":0},{"$f":"IF(E9<$L$6,0,IF(E9<$M$6,100*B9*$C$39,100*B9))","v":0},{"$f":"'Summary Sheet'!D14","v":0},{"$f":"IF(G9<$L$6,0,IF(G9<$M$6,100*B9*$C$39,100*B9))","v":0},{"$f":"D9*$F$38+F9*$F$39+H9*$F$40","v":0},{"$f":"IF(I9<=N9,M45,IF(I9<=M9,L45,K45))","v":"Submission of: Three Year Capital Management Plan\nEnsure proper compliance of ALM Guidelines\nALCO meeting minutes."},null,{"$f":"B9*100*$L$7","v":10},{"$f":"B9*100*$M$7","v":8},{"$f":"L9*$N$7","v":6}]
["2. Credit Risk",{"$f":"SUM(B11:B15)","v":0.60000000000000009},null,{"$f":"SUM(D11:D15)","v":0},null,{"$f":"SUM(F11:F15)","v":0},null,{"$f":"SUM(H11:H15)","v":0},0,null,null,60.000000000000007,48.000000000000007,{"$f":"L10*$N$7","v":36}]
{"$rows_left_out":55}
{"sheet":"Summary Sheet","index":3,"n_rows":112,"n_cols":6,"rows_kept":112,"cut":false,"hidden":false,"merged":[[55,0,55,3],[2,0,2,1],[8,0,8,3],[9,0,10,0],[16,0,16,3],[17,0,18,0],[83,0,83,3],[96,0,96,1],[101,0,101,3],[63,0,64,0],[23,0,23,3],[24,0,25,0],[30,0,30,3],[31,0,32,0],[38,0,39,0],[37,0,37,3],[48,0,48,3],[49,0,50,0],[62,0,62,3],[70,0,70,1],[75,0,75,3],[76,0,77,0]]}
["Name of the Institution :",{"$f":"IF('Credit Input'!C1=\"\",\"\",'Credit Input'!C1)","v":""}]
["Reporting Base Date:",{"$f":"'Credit Input'!C3","v":"00:00:00"}]
["Current Scenario"]
["Regulatory Capital (BDT in Crore )",{"$f":"'Credit Input'!C8","v":0}]
["Risk Weigheted Assets (RWA) (BDT in Crore)",{"$f":"'Credit Input'!C9","v":0}]
["Capital Adequacy Ratio (CAR)",{"$f":"IF(B5<>0,B4/B5,0)","v":0}]
[]
["1. Interest Rate Risk",null,null,"(BDT in Crore)"]
["                           Interest Rate Risk"]
["Magnitude of Shock","Minor","Moderate","Major"]
{"$rows_left_out":103}
{"sheet":"Insolvency Output","index":4,"n_rows":32,"n_cols":4,"rows_kept":32,"cut":false,"hidden":false,"merged":[[4,0,4,1],[15,0,15,3]]}
["Name of the Institution :",{"$f":"IF('Credit Input'!C1=\"\",\"\",'Credit Input'!C1)","v":""}]
["Reporting Base Date:",{"$f":"'Credit Input'!C3","v":"00:00:00"}]
[]
["Insolvency Ratio"]
["Basic Information"]
["Regulatory Capital (BDT in Crore )",{"$f":"'Credit Input'!C8","v":0}]
["Total Loan (BDT in Crore)",{"$f":"'Credit Input'!C43","v":0}]
["Total NPL (BDT in Crore)",{"$f":"SUM('Credit Input'!J43:K43,'Credit Input'!M43:N43,'Credit Input'!P43:Q43)","v":0}]
["Total of NPL and Regulatory Capital",{"$f":"B6+B8","v":0}]
["Infection Ratio (NPL to Loans)",{"$f":"IF(B7<>0,B8/B7,0)","v":0}]
{"$rows_left_out":23}
{"sheet":"Interest Rate Output","index":5,"n_rows":21,"n_cols":7,"rows_kept":21,"cut":false,"hidden":false,"merged":[[3,0,4,0],[3,1,3,5],[13,0,13,3],[14,0,15,0]]}
["Name of the Institution :",{"$f":"IF('Credit Input'!C1=\"\",\"\",'Credit Input'!C1)","v":""}]
["Reporting Base Date:",{"$f":"'Credit Input'!C3","v":"00:00:00"}]
[]
["Particulars","Maturitywise Distribution of Assets-Liabilities"]
[null,"1 to 30/31 day (One month)","Over 1 month to 2 months","Over 2 months to 3 months","Over 3 months to 6 months","Over 6 months to 1 year"]
[1,2,3,4,5,6]
["A. TOTAL RATE SENSITIVE LIABILITIES (A)",{"$f":"'Interest Rate Input'!B18","v":0},{"$f":"'Interest Rate Input'!C18","v":0},{"$f":"'Interest Rate Input'!D18","v":0},{"$f":"'Interest Rate Input'!E18","v":0},{"$f":"'Interest Rate Input'!F18","v":0}]
["B. TOTAL RATE SENSITIVE ASSETS (B)",{"$f":"'Interest Rate Input'!B30","v":0},{"$f":"'Interest Rate Input'!C30","v":0},{"$f":"'Interest Rate Input'!D30","v":0},{"$f":"'Interest Rate Input'!E30","v":0},{"$f":"'Interest Rate Input'!F30","v":0}]
["C. MISMATCH",{"$f":"B8-B7","v":0},{"$f":"C8-C7","v":0},{"$f":"D8-D7","v":0},{"$f":"E8-E7","v":0},{"$f":"F8-F7","v":0}]
["D. CUMULATIVE MISMATCH",{"$f":"B9","v":0},{"$f":"B10+C9","v":0},{"$f":"C10+D9","v":0},{"$f":"D10+E9","v":0},{"$f":"E10+F9","v":0}]
{"$rows_left_out":12}
{"sheet":"Liquidity Output","index":6,"n_rows":37,"n_cols":20,"rows_kept":37,"cut":false,"hidden":false,"merged":[[3,0,4,0],[3,1,3,9]]}
["Name of the Institution :",{"$f":"IF('Credit Input'!C1=\"\",\"\",'Credit Input'!C1)","v":""}]
["Reporting Base Date:",{"$f":"'Credit Input'!C3","v":"00:00:00"}]
[null,null,null,null,null,null,null,null,null,"(Amount in crore)"]
["Particulars","Maturitywise Distribution of Assets-Liabilities"]
[null,"1 to 30/31 day (One month)","Over 1 month to 2 months","Over 2 months to 3 months","Over 3 months to 6 months","Over 6 months to 1 year","Over 1 year to 3 years","Over 3 years to 5 years","Over 5 years","Total"]
[1,2,3,4,5,6,7,8,9,10]
["A. TOTAL OUTFLOWS (A)",{"$f":"'Liquidity Input'!B33","v":0},{"$f":"'Liquidity Input'!C33","v":0},{"$f":"'Liquidity Input'!D33","v":0},{"$f":"'Liquidity Input'!E33","v":0},{"$f":"'Liquidity Input'!F33","v":0},{"$f":"'Liquidity Input'!G33","v":0},{"$f":"'Liquidity Input'!H33","v":0},{"$f":"'Liquidity Input'!I33","v":0},{"$f":"'Liquidity Input'!J33","v":0}]
["B. TOTAL INFLOWS (B)",{"$f":"'Liquidity Input'!B56","v":0},{"$f":"'Liquidity Input'!C56","v":0},{"$f":"'Liquidity Input'!D56","v":0},{"$f":"'Liquidity Input'!E56","v":0},{"$f":"'Liquidity Input'!F56","v":0},{"$f":"'Liquidity Input'!G56","v":0},{"$f":"'Liquidity Input'!H56","v":0},{"$f":"'Liquidity Input'!I56","v":0},{"$f":"'Liquidity Input'!J56","v":0}]
["C. MISMATCH",{"$f":"B8-B7","v":0},{"$f":"C8-C7","v":0},0,0,0,0,0,0,0]
["D. CUMULATIVE MISMATCH",{"$f":"B9","v":0},{"$f":"B10+C9","v":0},0,0,0,0,0,0]
{"$rows_left_out":28}
{"sheet":"Share Risks","index":7,"n_rows":16,"n_cols":4,"rows_kept":16,"cut":false,"hidden":false,"merged":[[3,0,3,1]]}
["Name of the Institution :",{"$f":"IF('Credit Input'!C1=\"\",\"\",'Credit Input'!C1)","v":""}]
["Reporting Base Date:",{"$f":"'Credit Input'!C3","v":"00:00:00"}]
[]
["Required Information"]
["Regulatory Capital (BDT in Crore)",{"$f":"'Credit Input'!C8","v":0}]
["Risk Weigheted Assets (RWA) (BDT in Crore)",{"$f":"'Credit Input'!C9","v":0}]
["Capital Adequacy Ratio (CAR)",{"$f":"'Credit Input'!C10","v":0}]
["Total Exposure in Stock Market (BDT in Crore)",{"$f":"'Liquidity Input'!J43","v":0}]
["Provision Surplus/Shortfall (BDT in Crore)",{"$f":"'Credit Input'!C11","v":0}]
[]
{"$rows_left_out":7}
{"sheet":"Credit Risk-5","index":8,"n_rows":35,"n_cols":4,"rows_kept":35,"cut":false,"hidden":false,"merged":[[3,0,3,1]]}
["Name of the Institution :",{"$f":"IF('Credit Input'!C1=\"\",\"\",'Credit Input'!C1)","v":""}]
["Reporting Base Date:",{"$f":"'Credit Input'!C3","v":"00:00:00"}]
[]
["Required Information"]
["Regulatory Capital (BDT in Crore )",{"$f":"'Credit Input'!C8","v":0}]
["Risk Weigheted Assets (RWA) (BDT in Crore)",{"$f":"'Credit Input'!C9","v":0}]
["Capital Adequacy Ratio (CAR)",{"$f":"IF(B6<>0,B5/B6,0)","v":0}]
["Total Loan to Top 10 Borrowers (BDT in Crore)",{"$f":"'Credit Input'!C48","v":0}]
["Total Loans for which Eligible Securities Held (BDT in Crore)",{"$f":"'Credit Input'!C49","v":0}]
["Total Loans for which No Eligible Securities Held (BDT in Crore)",{"$f":"'Credit Input'!C50","v":0}]
{"$rows_left_out":26}
{"sheet":"Credit Risk-4","index":9,"n_rows":32,"n_cols":8,"rows_kept":32,"cut":false,"hidden":false,"merged":[[18,1,18,2],[20,1,20,2],[8,0,9,0],[3,0,3,1],[19,1,19,2]]}
["Name of the Institution :",{"$f":"IF('Credit Input'!C1=\"\",\"\",'Credit Input'!C1)","v":""}]
["Reporting Base Date:",{"$f":"'Credit Input'!C3","v":"00:00:00"}]
[]
["Basic Information"]
["Regulatory Capital (BDT in Crore )",{"$f":"'Credit Input'!C8","v":0},null,null,{"$f":"VLOOKUP(22,'Credit Input'!$AB$17:$AT$38,2,FALSE)","v":"Trade and Commerce"}]
["Risk Weigheted Assets (RWA) (BDT in Crore)",{"$f":"'Credit Input'!C9","v":0}]
["Capital Adequacy Ratio (CAR)",{"$f":"IF(B6<>0,B5/B6,0)","v":0}]
[]
["Particulars","Sector of Highest Loan","Sector of 2nd Highest Loan"]
[null,{"$f":"VLOOKUP(22,'Credit Input'!$AB$17:$AT$38,2,FALSE)","v":"Trade and Commerce"},{"$f":"VLOOKUP(21,'Credit Input'!$AB$17:$AT$38,2,FALSE)","v":"Garments and Knitwear"},null,null,null,null,{"$f":"CONCATENATE(\"Loan Disbursed to\", \" \",VLOOKUP(22,'Credit Input'!$AB$17:$AT$38,2,FALSE),\" \",\"Sector\")","v":"Loan Disbursed to Trade and Commerce Sector"}]
{"$rows_left_out":23}
{"sheet":"Credit Risk-3","index":10,"n_rows":20,"n_cols":4,"rows_kept":20,"cut":false,"hidden":false,"merged":[[3,0,3,1]]}
["Name of the Institution :",{"$f":"IF('Credit Input'!C1=\"\",\"\",'Credit Input'!C1)","v":""}]
["Reporting Base Date:",{"$f":"'Credit Input'!C3","v":"00:00:00"}]
[]
["Required Information"]
["Regulatory Capital (BDT in Crore )",{"$f":"'Credit Input'!C8","v":0}]
["Risk Weigheted Assets (RWA) (BDT in Crore)",{"$f":"'Credit Input'!C9","v":0}]
["Capital Adequacy Ratio (CAR)",{"$f":"IF(B6<>0,B5/B6,0)","v":0}]
["VES for SS Loan (BDT in Crore)",{"$f":"'Credit Input'!L43","v":0}]
["VES for DF Loan (BDT in Crore)",{"$f":"'Credit Input'!O43","v":0}]
["VES for BL Loan (BDT in Crore)",{"$f":"'Credit Input'!R43","v":0}]
{"$rows_left_out":11}
{"sheet":"Credit Risk-2","index":11,"n_rows":24,"n_cols":5,"rows_kept":24,"cut":false,"hidden":false,"merged":[[3,0,3,1]]}
["Name of the Institution :",{"$f":"IF('Credit Input'!C1=\"\",\"\",'Credit Input'!C1)","v":""}]
["Reporting Base Date:",{"$f":"'Credit Input'!C3","v":"00:00:00"}]
[]
["Basic Information"]
["Regulatory Capital (BDT in Crore )",{"$f":"'Credit Input'!C8","v":0}]
["Risk Weigheted Assets (BDT in Crore)",{"$f":"'Credit Input'!C9","v":0}]
["Capital Adequacy Ratio (CAR)",{"$f":"IF(B6<>0,B5/B6,0)","v":0}]
["Current Provision (BDT in Crore)",{"$f":"(('Credit Input'!D43+'Credit Input'!E43)*'Credit Input'!C61+('Credit Input'!G43+'Credit Input'!H43)*'Credit Input'!D61+('Credit Input'!J43+'Credit Input'!K43-'Credit Input'!L43)*'Credit Input'!E61+('Credit Input'!M43+'Credit Input'!N43-'Credit Input'!O43)*'Credit Input'!F61+('Credit Input'!P43+'Credit Input'!Q43-'Credit Input'!R43)*'Credit Input'!G61)","v":0}]
["Provision Surplus/Shortfall",{"$f":"'Credit Input'!C11","v":0}]
[]
{"$rows_left_out":15}
{"sheet":"Credit Risk-1","index":12,"n_rows":32,"n_cols":4,"rows_kept":32,"cut":false,"hidden":false,"merged":[[8,0,8,1],[3,0,3,1]]}
["Name of the Institution :",{"$f":"IF('Credit Input'!C1=\"\",\"\",'Credit Input'!C1)","v":""}]
["Reporting Base Date:",{"$f":"'Credit Input'!C3","v":"00:00:00"}]
[]
["Basic Information"]
["Regulatory Capital (BDT in Crore )",{"$f":"'Credit Input'!C8","v":0}]
["Risk Weigheted Assets (RWA) (BDT in Crore)",{"$f":"'Credit Input'!C9","v":0}]
["Capital Adequacy Ratio (CAR)",{"$f":"IF(B6<>0,B5/B6,0)","v":0}]
[]
["Required Information"]
["Total Loan (BDT in Crore)",{"$f":"'Credit Input'!C43","v":0}]
{"$rows_left_out":23}
{"sheet":"Interest Rate Input","index":13,"n_rows":41,"n_cols":10,"rows_kept":41,"cut":false,"hidden":true,"merged":[[4,0,5,0],[4,1,4,9]]}
["Name of the Institution :",{"$f":"IF('Credit Input'!C1=\"\",\"\",'Credit Input'!C1)","v":""}]
["Reporting Base Date:",{"$f":"'Credit Input'!C3","v":"00:00:00"}]
[]
[null,null,null,null,null,null,null,null,null,"(Amount in crore)"]
["Particulars","Projected Figure"]
[null,"1 to 30/31 day (One month)","Over 1 month to 2 months","Over 2 months to 3 months","Over 3 months to 6 months","Over 6 months to 1 year","Over 1 year to 3 years","Over 3 years to 5 years","Over 5 years","Total"]
[1,2,3,4,5,6,7,8,9,10]
["A. Rate SENSITIVE LIABILITIES"]
["1. Notes, bonds & debentures",{"$f":"SUM(B10:B11)","v":0},{"$f":"SUM(C10:C11)","v":0},0,0,0,0,0,0,0]
["(a) Plain vanilla bonds/debentures",{"$f":"'Liquidity Input'!B14","v":0},{"$f":"'Liquidity Input'!C14","v":0},{"$f":"'Liquidity Input'!D14","v":0},{"$f":"'Liquidity Input'!E14","v":0},{"$f":"'Liquidity Input'!F14","v":0},{"$f":"'Liquidity Input'!G14","v":0},{"$f":"'Liquidity Input'!H14","v":0},{"$f":"'Liquidity Input'!I14","v":0},{"$f":"SUM(B10:I10)","v":0}]
{"$rows_left_out":32}
{"sheet":"Liquidity Input","index":14,"n_rows":110,"n_cols":15,"rows_kept":110,"cut":false,"hidden":false,"merged":[[4,0,5,0],[4,1,4,9]]}
[]
["Name of the FI",":",{"$f":"IF('Credit Input'!C1=\"\",\"\",'Credit Input'!C1)","v":""}]
["Reporting Base Date",":",{"$f":"'Credit Input'!C3","v":"00:00:00"}]
[null,null,null,null,null,null,null,null,"(Amount in crore)"]
["Particulars"]
[null,"1 to 30/31 day (One month)","Over 1 month to 2 months","Over 2 months to 3 months","Over 3 months to 6 months","Over 6 months to 1 year","Over 1 year to 3 years","Over 3 years to 5 years","Over 5 years","Total"]
[1,2,3,4,5,6,7,8,9,10]
["A. Outflows "]
["1. Capital",{"$f":"SUM(B10:B11)","v":0},{"$f":"SUM(C10:C11)","v":0},0,0,0,0,0,0,{"$f":"SUM(B9:I9)","v":0}]
["(a) Equity and perpetual preference shares",null,null,null,null,null,null,null,null,{"$f":"SUM(B10:I10)","v":0}]
{"$rows_left_out":101}
{"sheet":"Credit Input","index":15,"n_rows":61,"n_cols":48,"rows_kept":61,"cut":false,"hidden":false,"merged":[[53,8,53,10],[53,11,53,13],[53,14,53,16],[14,43,14,45],[53,17,53,19],[14,31,14,33],[14,34,14,36],[14,37,14,39],[14,40,14,42],[13,2,13,17],[14,15,14,17],[14,12,14,14],[14,9,14,11],[14,6,14,8],[14,3,14,5],[0,0,0,1],[2,0,2,1],[1,0,1,1],[59,0,60,1],[45,2,45,12],[14,2,15,2],[45,0,46,0],[45,1,46,1],[53,0,55,1],[53,2,53,4],[53,5,53,7],[5,0,6,0],[5,1,6,1],[5,2,6,2],[13,0,15,0],[13,1,15,1]]}
["Name of the Institution:"]
["Acronym of the name:"]
["Reporting Base Date:"]
[]
["Table: 1 ","Basic Information"]
["Sl. No","Particulars","Amount in \nBDT Crore "]
[]
[1,"Regulatory Capital"]
[2,"Risk Weighted Assets"]
[3,"CAR %",{"$f":"IF(C9<>0,C8/C9,0)","v":0}]
{"$rows_left_out":51}